Reaction Details
TargetEndothelial lipase
LigandBDBM50253986
Substrate/Competitorn/a
Meas. Tech.ChEMBL_559992 (CHEMBL1018742)
IC50>50000±n/a nM
Citation Goodman, KBBury, MJCheung, MCichy-Knight, MADowdell, SEDunn, AKLee, DLieby, JAMoore, MLScherzer, DASha, DSuarez, DPMurphy, DJHarpel, MRManas, ESMcNulty, DEAnnan, RSMatico, RESchwartz, BKTrill, JJSweitzer, TDWang, DYKeller, PMKrawiec, JAJaye, MC Discovery of potent, selective sulfonylfuran urea endothelial lipase inhibitors. Bioorg Med Chem Lett19:27-30 (2008) 
 
Endothelial lipase
Name:Endothelial lipase
Type:Protein
Mol. Mass.:56805.62
Organism:Homo sapiens (Human)
Description:Q9Y5X9
Residue:500
BDBM50253986
NameBDBM50253986
Synonyms:1-(2-methyl-4-(morpholinosulfonyl)phenyl)-3-phenylurea | CHEMBL506964
TypeSmall organic molecule
Emp. Form.C18H21N3O4S
Mol. Mass.375.442
SMILESCc1cc(ccc1NC(=O)Nc1ccccc1)S(=O)(=O)N1CCOCC1