Reaction Details
TargetEndothelial lipase
LigandBDBM50254436
Substrate/Competitorn/a
Meas. Tech.ChEMBL_559992 (CHEMBL1018742)
IC50 300±n/a nM
Citation Goodman, KBBury, MJCheung, MCichy-Knight, MADowdell, SEDunn, AKLee, DLieby, JAMoore, MLScherzer, DASha, DSuarez, DPMurphy, DJHarpel, MRManas, ESMcNulty, DEAnnan, RSMatico, RESchwartz, BKTrill, JJSweitzer, TDWang, DYKeller, PMKrawiec, JAJaye, MC Discovery of potent, selective sulfonylfuran urea endothelial lipase inhibitors. Bioorg Med Chem Lett19:27-30 (2008) 
 
Endothelial lipase
Name:Endothelial lipase
Type:Protein
Mol. Mass.:56805.62
Organism:Homo sapiens (Human)
Description:Q9Y5X9
Residue:500
BDBM50254436
NameBDBM50254436
Synonyms:5-Methyl-4-(3-phenyl-ureido)-furan-2-sulfonic acid dimethylamide | CHEMBL468282
TypeSmall organic molecule
Emp. Form.C14H17N3O4S
Mol. Mass.323.367
SMILESCN(C)S(=O)(=O)c1cc(NC(=O)Nc2ccccc2)c(C)o1