Reaction Details
Target11-beta-hydroxysteroid dehydrogenase 1
LigandBDBM50248310
Substrate/Competitorn/a
Meas. Tech.ChEMBL_543009 (CHEMBL1018625)
IC50 1±n/a nM
Citation Sun, DWang, ZCardozo, MChoi, RDegraffenreid, MDi, YHe, XJaen, JCLabelle, MLiu, JMa, JMiao, SSudom, ATang, LTu, HUrsu, SWalker, NYan, XYe, QPowers, JP Synthesis and optimization of arylsulfonylpiperazines as a novel class of inhibitors of 11 beta-hydroxysteroid dehydrogenase type 1 (11 beta-HSD1). Bioorg Med Chem Lett19:1522-7 (2009) 
 
11-beta-hydroxysteroid dehydrogenase 1
Name:11-beta-hydroxysteroid dehydrogenase 1
Type:Enzyme
Mol. Mass.:32409.16
Organism:Homo sapiens (Human)
Description:P28845
Residue:292
BDBM50248310
NameBDBM50248310
Synonyms:(R)-1-(4-tert-butylphenylsulfonyl)-2-methyl-4-(3-(pyridin-4-yl)propyl)piperazine | CHEMBL473954
TypeSmall organic molecule
Emp. Form.C23H33N3O2S
Mol. Mass.415.592
SMILESC[C@@H]1CN(CCCc2ccncc2)CCN1S(=O)(=O)c1ccc(cc1)C(C)(C)C