Reaction Details
Target11-beta-hydroxysteroid dehydrogenase 1
LigandBDBM32573
Substrate/Competitorn/a
Meas. Tech.ChEMBL_543009 (CHEMBL1018625)
IC50 3±n/a nM
Citation Sun, DWang, ZCardozo, MChoi, RDegraffenreid, MDi, YHe, XJaen, JCLabelle, MLiu, JMa, JMiao, SSudom, ATang, LTu, HUrsu, SWalker, NYan, XYe, QPowers, JP Synthesis and optimization of arylsulfonylpiperazines as a novel class of inhibitors of 11 beta-hydroxysteroid dehydrogenase type 1 (11 beta-HSD1). Bioorg Med Chem Lett19:1522-7 (2009) 
 
11-beta-hydroxysteroid dehydrogenase 1
Name:11-beta-hydroxysteroid dehydrogenase 1
Type:Enzyme
Mol. Mass.:32409.16
Organism:Homo sapiens (Human)
Description:P28845
Residue:292
BDBM32573
NameBDBM32573
Synonyms:CHEMBL427896 | arylsulfonylpiperazine, 45
TypeSmall organic molecule
Emp. Form.C21H27N3O4S
Mol. Mass.417.522
SMILESC[C@@H]1CN(CCN1S(=O)(=O)c1ccc(cc1)C(C)(C)C)c1ccc(cc1)[N+]([O-])=O