Reaction Details
TargetCannabinoid receptor 1
LigandBDBM50267906
Substrate/Competitorn/a
Meas. Tech.ChEMBL_563053 (CHEMBL1011883)
EC50 300±n/a nM
Citation Vachal, PFletcher, JMFong, TMHuang, CCLao, JXiao, JCShen, CPStrack, AMShearman, LStribling, SChen, RZFrassetto, ATong, XWang, JBall, RGTsou, NNHickey, GJThompson, DFFaidley, TDNicolich, SAchanfuo-Yeboah, JHora, DFHale, JJHagmann, WK 1-Sulfonyl-4-acylpiperazines as selective cannabinoid-1 receptor (CB1R) inverse agonists for the treatment of obesity. J Med Chem52:2550-8 (2009) 
 
Cannabinoid receptor 1
Name:Cannabinoid receptor 1
Type:G Protein-Coupled Receptor (GPCR)
Mol. Mass.:52868.96
Organism:Homo sapiens (Human)
Description:P21554
Residue:472
BDBM50267906
NameBDBM50267906
Synonyms:CHEMBL489450 | cyclohexyl(3-(naphthalen-1-ylsulfonyl)-3,8-diazabicyclo[3.2.1]octan-8-yl)methanone
TypeSmall organic molecule
Emp. Form.C23H28N2O3S
Mol. Mass.412.545
SMILESO=C(C1CCCCC1)N1C2CCC1CN(C2)S(=O)(=O)c1cccc2ccccc12