Reaction Details
TargetCannabinoid receptor 1
LigandBDBM50267942
Substrate/Competitorn/a
Meas. Tech.ChEMBL_563052 (CHEMBL1011882)
IC50 220±n/a nM
Citation Vachal, PFletcher, JMFong, TMHuang, CCLao, JXiao, JCShen, CPStrack, AMShearman, LStribling, SChen, RZFrassetto, ATong, XWang, JBall, RGTsou, NNHickey, GJThompson, DFFaidley, TDNicolich, SAchanfuo-Yeboah, JHora, DFHale, JJHagmann, WK 1-Sulfonyl-4-acylpiperazines as selective cannabinoid-1 receptor (CB1R) inverse agonists for the treatment of obesity. J Med Chem52:2550-8 (2009) 
 
Cannabinoid receptor 1
Name:Cannabinoid receptor 1
Type:G Protein-Coupled Receptor (GPCR)
Mol. Mass.:52868.96
Organism:Homo sapiens (Human)
Description:P21554
Residue:472
BDBM50267942
NameBDBM50267942
Synonyms:1-(4-(3,5-dichlorophenylsulfonyl)piperazin-1-yl)-2-phenylpropan-1-one | CHEMBL490024
TypeSmall organic molecule
Emp. Form.C19H20Cl2N2O3S
Mol. Mass.427.345
SMILESCC(C(=O)N1CCN(CC1)S(=O)(=O)c1cc(Cl)cc(Cl)c1)c1ccccc1