Reaction Details
TargetCannabinoid receptor 1
LigandBDBM50267824
Substrate/Competitorn/a
Meas. Tech.ChEMBL_563052 (CHEMBL1011882)
IC50 100±n/a nM
Citation Vachal, PFletcher, JMFong, TMHuang, CCLao, JXiao, JCShen, CPStrack, AMShearman, LStribling, SChen, RZFrassetto, ATong, XWang, JBall, RGTsou, NNHickey, GJThompson, DFFaidley, TDNicolich, SAchanfuo-Yeboah, JHora, DFHale, JJHagmann, WK 1-Sulfonyl-4-acylpiperazines as selective cannabinoid-1 receptor (CB1R) inverse agonists for the treatment of obesity. J Med Chem52:2550-8 (2009) 
 
Cannabinoid receptor 1
Name:Cannabinoid receptor 1
Type:G Protein-Coupled Receptor (GPCR)
Mol. Mass.:52868.96
Organism:Homo sapiens (Human)
Description:P21554
Residue:472
BDBM50267824
NameBDBM50267824
Synonyms:5-(3-(trifluoromethyl)-5-(4-((1R,2R)-2-(4-(trifluoromethyl)phenyl)cyclopropanecarbonyl)piperazin-1-ylsulfonyl)phenyl)-1,3,4-oxadiazol-2(3H)-one | CHEMBL488109
TypeSmall organic molecule
Emp. Form.C24H20F6N4O5S
Mol. Mass.590.495
SMILESFC(F)(F)c1ccc(cc1)[C@@H]1C[C@H]1C(=O)N1CCN(CC1)S(=O)(=O)c1cc(cc(c1)C(F)(F)F)-c1n[nH]c(=O)o1