Reaction Details
TargetCannabinoid receptor 1
LigandBDBM50267256
Substrate/Competitorn/a
Meas. Tech.ChEMBL_563053 (CHEMBL1011883)
EC50 40±n/a nM
Citation Vachal, PFletcher, JMFong, TMHuang, CCLao, JXiao, JCShen, CPStrack, AMShearman, LStribling, SChen, RZFrassetto, ATong, XWang, JBall, RGTsou, NNHickey, GJThompson, DFFaidley, TDNicolich, SAchanfuo-Yeboah, JHora, DFHale, JJHagmann, WK 1-Sulfonyl-4-acylpiperazines as selective cannabinoid-1 receptor (CB1R) inverse agonists for the treatment of obesity. J Med Chem52:2550-8 (2009) 
 
Cannabinoid receptor 1
Name:Cannabinoid receptor 1
Type:G Protein-Coupled Receptor (GPCR)
Mol. Mass.:52868.96
Organism:Homo sapiens (Human)
Description:P21554
Residue:472
BDBM50267256
NameBDBM50267256
Synonyms:1-(4-(3,5-dichlorophenylsulfonyl)piperazin-1-yl)-2-(pyridin-2-yl)ethanone | CHEMBL477878
TypeSmall organic molecule
Emp. Form.C17H17Cl2N3O3S
Mol. Mass.414.306
SMILESClc1cc(Cl)cc(c1)S(=O)(=O)N1CCN(CC1)C(=O)Cc1ccccn1