Reaction Details
TargetCannabinoid receptor 2
LigandBDBM50267825
Substrate/Competitorn/a
Meas. Tech.ChEMBL_563054 (CHEMBL1011884)
IC50>10000±n/a nM
Citation Vachal, PFletcher, JMFong, TMHuang, CCLao, JXiao, JCShen, CPStrack, AMShearman, LStribling, SChen, RZFrassetto, ATong, XWang, JBall, RGTsou, NNHickey, GJThompson, DFFaidley, TDNicolich, SAchanfuo-Yeboah, JHora, DFHale, JJHagmann, WK 1-Sulfonyl-4-acylpiperazines as selective cannabinoid-1 receptor (CB1R) inverse agonists for the treatment of obesity. J Med Chem52:2550-8 (2009) 
 
Cannabinoid receptor 2
Name:Cannabinoid receptor 2
Type:G Protein-Coupled Receptor (GPCR)
Mol. Mass.:39690.94
Organism:Homo sapiens (Human)
Description:P34972
Residue:360
BDBM50267825
NameBDBM50267825
Synonyms:3-(3-(trifluoromethyl)-5-(4-((1R,2R)-2-(4-(trifluoromethyl)phenyl)cyclopropanecarbonyl)piperazin-1-ylsulfonyl)phenyl)-1H-1,2,4-triazol-5(4H)-one | CHEMBL488324
TypeSmall organic molecule
Emp. Form.C24H21F6N5O4S
Mol. Mass.589.51
SMILESFC(F)(F)c1ccc(cc1)[C@@H]1C[C@H]1C(=O)N1CCN(CC1)S(=O)(=O)c1cc(cc(c1)C(F)(F)F)-c1n[nH]c(=O)[nH]1