Reaction Details
TargetAurora kinase B
LigandBDBM50259563
Substrate/Competitorn/a
Meas. Tech.ChEMBL_499152 (CHEMBL1011426)
IC50 1400±n/a nM
Citation Lovering, FKirincich, SWang, WCombs, KResnick, LSabalski, JEButera, JLiu, JParris, KTelliez, JB Identification and SAR of squarate inhibitors of mitogen activated protein kinase-activated protein kinase 2 (MK-2). Bioorg Med Chem17:3342-51 (2009) 
 
Aurora kinase B
Name:Aurora kinase B
Type:Protein
Mol. Mass.:39327.72
Organism:Homo sapiens (Human)
Description:Q96GD4
Residue:344
BDBM50259563
NameBDBM50259563
Synonyms:2-{[3,4-Dioxo-2-(pyridin-4-ylamino)cyclobut-1-en-1-yl]amino}-2-(3-hydroxyphenyl)acetamide | CHEMBL511410
TypeSmall organic molecule
Emp. Form.C17H14N4O4
Mol. Mass.338.3175
SMILESNC(=O)C(Nc1c(Nc2ccncc2)c(=O)c1=O)c1cccc(O)c1