Reaction Details
TargetAurora kinase B
LigandBDBM50259638
Substrate/Competitorn/a
Meas. Tech.ChEMBL_499152 (CHEMBL1011426)
IC50 10800±n/a nM
Citation Lovering, FKirincich, SWang, WCombs, KResnick, LSabalski, JEButera, JLiu, JParris, KTelliez, JB Identification and SAR of squarate inhibitors of mitogen activated protein kinase-activated protein kinase 2 (MK-2). Bioorg Med Chem17:3342-51 (2009) 
 
Aurora kinase B
Name:Aurora kinase B
Type:Protein
Mol. Mass.:39327.72
Organism:Homo sapiens (Human)
Description:Q96GD4
Residue:344
BDBM50259638
NameBDBM50259638
Synonyms:3-{[2-(3-Thienyl)pyridin-4-yl]amino}-4-{[(1R)-1-phenylethyl]amino}cyclobut-3-ene-1,2-dione | CHEMBL481248
TypeSmall organic molecule
Emp. Form.C21H17N3O2S
Mol. Mass.375.444
SMILESC[C@@H](Nc1c(Nc2ccnc(c2)-c2ccsc2)c(=O)c1=O)c1ccccc1