Reaction Details
TargetProto-oncogene tyrosine-protein kinase Src
LigandBDBM50259532
Substrate/Competitorn/a
Meas. Tech.ChEMBL_499164 (CHEMBL1011438)
IC50>50000±n/a nM
Citation Lovering, FKirincich, SWang, WCombs, KResnick, LSabalski, JEButera, JLiu, JParris, KTelliez, JB Identification and SAR of squarate inhibitors of mitogen activated protein kinase-activated protein kinase 2 (MK-2). Bioorg Med Chem17:3342-51 (2009) 
 
Proto-oncogene tyrosine-protein kinase Src
Name:Proto-oncogene tyrosine-protein kinase Src
Type:Protein
Mol. Mass.:59838.60
Organism:Homo sapiens (Human)
Description:P12931
Residue:536
BDBM50259532
NameBDBM50259532
Synonyms:2-{[3,4-Dioxo-2-(pyridin-4-ylamino)cyclobut-1-en-1-yl]amino}-2-phenylacetamide | CHEMBL467079
TypeSmall organic molecule
Emp. Form.C17H14N4O3
Mol. Mass.322.3181
SMILESNC(=O)C(Nc1c(Nc2ccncc2)c(=O)c1=O)c1ccccc1