Reaction Details
TargetPlatelet-derived growth factor receptor alpha
LigandBDBM50259376
Substrate/Competitorn/a
Meas. Tech.ChEMBL_499159 (CHEMBL1011433)
IC50 40500±n/a nM
Citation Lovering, FKirincich, SWang, WCombs, KResnick, LSabalski, JEButera, JLiu, JParris, KTelliez, JB Identification and SAR of squarate inhibitors of mitogen activated protein kinase-activated protein kinase 2 (MK-2). Bioorg Med Chem17:3342-51 (2009) 
 
Platelet-derived growth factor receptor alpha
Name:Platelet-derived growth factor receptor alpha
Type:Protein
Mol. Mass.:122633.38
Organism:Homo sapiens (Human)
Description:P16234
Residue:1089
BDBM50259376
NameBDBM50259376
Synonyms:3-((R)-1-Phenyl-ethylamino)-4-(pyridin-4-ylamino)-cyclobut-3-ene-1,2-dione CHEMBL466496
TypeSmall organic molecule
Emp. Form.C17H15N3O2
Mol. Mass.293.3199
SMILESC[C@@H](Nc1c(Nc2ccncc2)c(=O)c1=O)c1ccccc1