Reaction Details
TargetMAP kinase-activated protein kinase 2
LigandBDBM50259568
Substrate/Competitorn/a
Meas. Tech.ChEMBL_499146 (CHEMBL1011420)
IC50>100000±n/a nM
Citation Lovering, FKirincich, SWang, WCombs, KResnick, LSabalski, JEButera, JLiu, JParris, KTelliez, JB Identification and SAR of squarate inhibitors of mitogen activated protein kinase-activated protein kinase 2 (MK-2). Bioorg Med Chem17:3342-51 (2009) 
 
MAP kinase-activated protein kinase 2
Name:MAP kinase-activated protein kinase 2
Type:Serine/threonine-protein kinase
Mol. Mass.:45579.87
Organism:Homo sapiens (Human)
Description:P49137
Residue:400
BDBM50259568
NameBDBM50259568
Synonyms:3-{[(1R)-1-Phenylethyl]amino}-4-(pyrimidin-4-ylamino)cyclobut-3-ene-1,2-dione | CHEMBL512454
TypeSmall organic molecule
Emp. Form.C16H14N4O2
Mol. Mass.294.308
SMILESC[C@@H](Nc1c(Nc2ccncn2)c(=O)c1=O)c1ccccc1