Reaction Details
TargetMAP kinase-activated protein kinase 2
LigandBDBM50259601
Substrate/Competitorn/a
Meas. Tech.ChEMBL_499146 (CHEMBL1011420)
IC50 5800±n/a nM
Citation Lovering, FKirincich, SWang, WCombs, KResnick, LSabalski, JEButera, JLiu, JParris, KTelliez, JB Identification and SAR of squarate inhibitors of mitogen activated protein kinase-activated protein kinase 2 (MK-2). Bioorg Med Chem17:3342-51 (2009) 
 
MAP kinase-activated protein kinase 2
Name:MAP kinase-activated protein kinase 2
Type:Serine/threonine-protein kinase
Mol. Mass.:45579.87
Organism:Homo sapiens (Human)
Description:P49137
Residue:400
BDBM50259601
NameBDBM50259601
Synonyms:3-{[2-(2-Fluorophenyl)pyridin-4-yl]amino}-4-{[(1R)-1-phenylethyl]amino}cyclobut-3-ene-1,2-dione | CHEMBL468125
TypeSmall organic molecule
Emp. Form.C23H18FN3O2
Mol. Mass.387.4063
SMILESC[C@@H](Nc1c(Nc2ccnc(c2)-c2ccccc2F)c(=O)c1=O)c1ccccc1