Reaction Details
TargetCytochrome P450 2C9
LigandBDBM50259598
Substrate/Competitorn/a
Meas. Tech.ChEMBL_499145 (CHEMBL1011419)
IC50 12000±n/a nM
Citation Lovering, FKirincich, SWang, WCombs, KResnick, LSabalski, JEButera, JLiu, JParris, KTelliez, JB Identification and SAR of squarate inhibitors of mitogen activated protein kinase-activated protein kinase 2 (MK-2). Bioorg Med Chem17:3342-51 (2009) 
 
Cytochrome P450 2C9
Name:Cytochrome P450 2C9
Type:Enzyme
Mol. Mass.:55636.33
Organism:Homo sapiens (Human)
Description:P11712
Residue:490
BDBM50259598
NameBDBM50259598
Synonyms:3-{[(1R)-1-Phenylethyl]amino}-4-(1H-pyrazol-3-ylamino)cyclobut-3-ene-1,2-dione | CHEMBL524472
TypeSmall organic molecule
Emp. Form.C15H14N4O2
Mol. Mass.282.2973
SMILESC[C@@H](Nc1c(Nc2ccn[nH]2)c(=O)c1=O)c1ccccc1