Reaction Details
TargetMAP kinase-activated protein kinase 2
LigandBDBM50259481
Substrate/Competitorn/a
Meas. Tech.ChEMBL_499146 (CHEMBL1011420)
IC50 49000±n/a nM
Citation Lovering, FKirincich, SWang, WCombs, KResnick, LSabalski, JEButera, JLiu, JParris, KTelliez, JB Identification and SAR of squarate inhibitors of mitogen activated protein kinase-activated protein kinase 2 (MK-2). Bioorg Med Chem17:3342-51 (2009) 
 
MAP kinase-activated protein kinase 2
Name:MAP kinase-activated protein kinase 2
Type:Serine/threonine-protein kinase
Mol. Mass.:45579.87
Organism:Homo sapiens (Human)
Description:P49137
Residue:400
BDBM50259481
NameBDBM50259481
Synonyms:3-{[1-(3-Methylphenyl)ethyl]amino}-4-(pyridin-4-ylamino)cyclobut-3-ene-1,2-dione | CHEMBL467731
TypeSmall organic molecule
Emp. Form.C18H17N3O2
Mol. Mass.307.3465
SMILESCC(Nc1c(Nc2ccncc2)c(=O)c1=O)c1cccc(C)c1