Reaction Details
TargetMAP kinase-activated protein kinase 2
LigandBDBM50259530
Substrate/Competitorn/a
Meas. Tech.ChEMBL_499146 (CHEMBL1011420)
IC50 8200±n/a nM
Citation Lovering, FKirincich, SWang, WCombs, KResnick, LSabalski, JEButera, JLiu, JParris, KTelliez, JB Identification and SAR of squarate inhibitors of mitogen activated protein kinase-activated protein kinase 2 (MK-2). Bioorg Med Chem17:3342-51 (2009) 
 
MAP kinase-activated protein kinase 2
Name:MAP kinase-activated protein kinase 2
Type:Serine/threonine-protein kinase
Mol. Mass.:45579.87
Organism:Homo sapiens (Human)
Description:P49137
Residue:400
BDBM50259530
NameBDBM50259530
Synonyms:3-{[1-(4-Fluorophenyl)ethyl]amino}-4-(pyridin-4-ylamino)cyclobut-3-ene-1,2-dione | CHEMBL467078
TypeSmall organic molecule
Emp. Form.C17H14FN3O2
Mol. Mass.311.3104
SMILESCC(Nc1c(Nc2ccncc2)c(=O)c1=O)c1ccc(F)cc1