Reaction Details
TargetPeroxisome proliferator-activated receptor gamma
LigandBDBM50293844
Substrate/Competitorn/a
Meas. Tech.ChEMBL_572391 (CHEMBL1035292)
IC50 16±n/a nM
Citation Liu, WLiu, KWood, HBMcCann, MEDoebber, TWChang, CHAkiyama, TEEinstein, MBerger, JPMeinke, PT Discovery of a peroxisome proliferator activated receptor gamma (PPARgamma) modulator with balanced PPARalpha activity for the treatment of type 2 diabetes and dyslipidemia. J Med Chem52:4443-53 (2009) 
 
Peroxisome proliferator-activated receptor gamma
Name:Peroxisome proliferator-activated receptor gamma
Type:Nuclear Receptor
Mol. Mass.:57613.46
Organism:Homo sapiens (Human)
Description:P37231
Residue:505
BDBM50293844
NameBDBM50293844
Synonyms:1-{3-[[3-(4-Chlorobenzoyl)-2-methyl-6-(trifluoromethoxy)-1H-indol-1-yl]methyl]phenoxy}-1-cyclobutanecarboxylic Acid | CHEMBL560830
TypeSmall organic molecule
Emp. Form.C29H23ClF3NO5
Mol. Mass.557.945
SMILESCc1c(C(=O)c2ccc(Cl)cc2)c2ccc(OC(F)(F)F)cc2n1Cc1cccc(OC2(CCC2)C(O)=O)c1