Reaction Details
TargetPeroxisome proliferator-activated receptor gamma
LigandBDBM50293849
Substrate/Competitorn/a
Meas. Tech.ChEMBL_572391 (CHEMBL1035292)
IC50 12±n/a nM
Citation Liu, WLiu, KWood, HBMcCann, MEDoebber, TWChang, CHAkiyama, TEEinstein, MBerger, JPMeinke, PT Discovery of a peroxisome proliferator activated receptor gamma (PPARgamma) modulator with balanced PPARalpha activity for the treatment of type 2 diabetes and dyslipidemia. J Med Chem52:4443-53 (2009) 
 
Peroxisome proliferator-activated receptor gamma
Name:Peroxisome proliferator-activated receptor gamma
Type:Nuclear Receptor
Mol. Mass.:57613.46
Organism:Homo sapiens (Human)
Description:P37231
Residue:505
BDBM50293849
NameBDBM50293849
Synonyms:(2R)-2-{3-[[3-(4-Chlorobenzoyl)-2-methyl-6-(trifluoromethoxy)-1H-indol-1-yl]methyl]phenoxy}pentanoic Acid | CHEMBL564036
TypeSmall organic molecule
Emp. Form.C29H25ClF3NO5
Mol. Mass.559.961
SMILESCCC[C@@H](Oc1cccc(Cn2c(C)c(C(=O)c3ccc(Cl)cc3)c3ccc(OC(F)(F)F)cc23)c1)C(O)=O