Reaction Details
TargetCytochrome P450 1A2
LigandBDBM50293851
Substrate/Competitorn/a
Meas. Tech.ChEMBL_572402 (CHEMBL1036138)
IC50 40000±n/a nM
Citation Liu, WLiu, KWood, HBMcCann, MEDoebber, TWChang, CHAkiyama, TEEinstein, MBerger, JPMeinke, PT Discovery of a peroxisome proliferator activated receptor gamma (PPARgamma) modulator with balanced PPARalpha activity for the treatment of type 2 diabetes and dyslipidemia. J Med Chem52:4443-53 (2009) 
 
Cytochrome P450 1A2
Name:Cytochrome P450 1A2
Type:Enzyme
Mol. Mass.:58423.38
Organism:Homo sapiens (Human)
Description:P05177
Residue:516
BDBM50293851
NameBDBM50293851
Synonyms:(2R)-2-{3-[[3-(4-Chlorobenzoyl)-2-methyl-6-(trifluoromethoxy)-1H-indol-1-yl]methyl]phenoxy}butanoic Acid | CHEMBL552240
TypeSmall organic molecule
Emp. Form.C28H23ClF3NO5
Mol. Mass.545.934
SMILESCC[C@@H](Oc1cccc(Cn2c(C)c(C(=O)c3ccc(Cl)cc3)c3ccc(OC(F)(F)F)cc23)c1)C(O)=O