Reaction Details
TargetPeroxisome proliferator-activated receptor alpha
LigandBDBM50293853
Substrate/Competitorn/a
Meas. Tech.ChEMBL_572395 (CHEMBL1036131)
EC50 350±n/a nM
Citation Liu, WLiu, KWood, HBMcCann, MEDoebber, TWChang, CHAkiyama, TEEinstein, MBerger, JPMeinke, PT Discovery of a peroxisome proliferator activated receptor gamma (PPARgamma) modulator with balanced PPARalpha activity for the treatment of type 2 diabetes and dyslipidemia. J Med Chem52:4443-53 (2009) 
 
Peroxisome proliferator-activated receptor alpha
Name:Peroxisome proliferator-activated receptor alpha
Type:PROTEIN
Mol. Mass.:52343.28
Organism:Mus musculus
Description:ChEMBL_572395
Residue:468
BDBM50293853
NameBDBM50293853
Synonyms:2-[3-[[3-(4-Chlorobenzoyl)-2-methyl-6-(trifluoromethoxy)-1Hindol-1-yl]methyl]phenoxy]acetic Acid | CHEMBL559567
TypeSmall organic molecule
Emp. Form.C26H19ClF3NO5
Mol. Mass.517.881
SMILESCc1c(C(=O)c2ccc(Cl)cc2)c2ccc(OC(F)(F)F)cc2n1Cc1cccc(OCC(O)=O)c1