Reaction Details
TargetPeroxisome proliferator-activated receptor alpha
LigandBDBM50293851
Substrate/Competitorn/a
Meas. Tech.ChEMBL_572400 (CHEMBL1036136)
EC50 0.550000±n/a nM
Citation Liu, WLiu, KWood, HBMcCann, MEDoebber, TWChang, CHAkiyama, TEEinstein, MBerger, JPMeinke, PT Discovery of a peroxisome proliferator activated receptor gamma (PPARgamma) modulator with balanced PPARalpha activity for the treatment of type 2 diabetes and dyslipidemia. J Med Chem52:4443-53 (2009) 
 
Peroxisome proliferator-activated receptor alpha
Name:Peroxisome proliferator-activated receptor alpha
Type:PROTEIN
Mol. Mass.:52119.89
Organism:Canis familiaris
Description:ChEMBL_796444
Residue:468
BDBM50293851
NameBDBM50293851
Synonyms:(2R)-2-{3-[[3-(4-Chlorobenzoyl)-2-methyl-6-(trifluoromethoxy)-1H-indol-1-yl]methyl]phenoxy}butanoic Acid | CHEMBL552240
TypeSmall organic molecule
Emp. Form.C28H23ClF3NO5
Mol. Mass.545.934
SMILESCC[C@@H](Oc1cccc(Cn2c(C)c(C(=O)c3ccc(Cl)cc3)c3ccc(OC(F)(F)F)cc23)c1)C(O)=O