Reaction Details
TargetPeroxisome proliferator-activated receptor alpha
LigandBDBM50293854
Substrate/Competitorn/a
Meas. Tech.ChEMBL_572395 (CHEMBL1036131)
EC50>3000±n/a nM
Citation Liu, WLiu, KWood, HBMcCann, MEDoebber, TWChang, CHAkiyama, TEEinstein, MBerger, JPMeinke, PT Discovery of a peroxisome proliferator activated receptor gamma (PPARgamma) modulator with balanced PPARalpha activity for the treatment of type 2 diabetes and dyslipidemia. J Med Chem52:4443-53 (2009) 
 
Peroxisome proliferator-activated receptor alpha
Name:Peroxisome proliferator-activated receptor alpha
Type:PROTEIN
Mol. Mass.:52343.28
Organism:Mus musculus
Description:ChEMBL_572395
Residue:468
BDBM50293854
NameBDBM50293854
Synonyms:2-(3-((1-(4-chlorobenzoyl)-2-methyl-5-(trifluoromethoxy)-1H-indol-3-yl)methyl)phenoxy)acetic acid | CHEMBL556073
TypeSmall organic molecule
Emp. Form.C26H19ClF3NO5
Mol. Mass.517.881
SMILESCc1c(Cc2cccc(OCC(O)=O)c2)c2cc(OC(F)(F)F)ccc2n1C(=O)c1ccc(Cl)cc1