Reaction Details
TargetHistamine H3 receptor
LigandBDBM50297368
Substrate/Competitorn/a
Meas. Tech.ChEMBL_583253 (CHEMBL1055808)
Ki 1±n/a nM
Citation Covel, JASantora, VJSmith, JMHayashi, RGallardo, CWeinhouse, MIIbarra, JBSchultz, JAPark, DMEstrada, SAHofilena, BJPulley, MDSmith, BMRen, ASuarez, MFrazer, JEdwards, JHauser, EKLorea, JSemple, GGrottick, AJ Design and evaluation of novel biphenyl sulfonamide derivatives with potent histamine H(3) receptor inverse agonist activity. J Med Chem52:5603-11 (2009) 
 
Histamine H3 receptor
Name:Histamine H3 receptor
Type:G Protein-Coupled Receptor (GPCR)
Mol. Mass.:48691.47
Organism:Homo sapiens (Human)
Description:Binding assays were using CHO cells stably expressing hH3R receptors.
Residue:445
BDBM50297368
NameBDBM50297368
Synonyms:4-{4'-[2-((R)-2-Methyl-pyrrolidin-1-yl)-ethyl]-biphenyl-4-sulfonyl}-morpholine | CHEMBL564380
TypeSmall organic molecule
Emp. Form.C23H30N2O3S
Mol. Mass.414.561
SMILESC[C@@H]1CCCN1CCc1ccc(cc1)-c1ccc(cc1)S(=O)(=O)N1CCOCC1