Reaction Details
TargetHistone-arginine methyltransferase CARM1
LigandBDBM50301080
Substrate/Competitorn/a
Meas. Tech.ChEMBL_598368 (CHEMBL1037272)
IC50 4.6±n/a nM
Citation Wan, HHuynh, TPang, SGeng, JVaccaro, WPoss, MATrainor, GLLorenzi, MVGottardis, MJayaraman, LPurandare, AV Benzo[d]imidazole inhibitors of Coactivator Associated Arginine Methyltransferase 1 (CARM1)--Hit to Lead studies. Bioorg Med Chem Lett19:5063-6 (2009) 
 
Histone-arginine methyltransferase CARM1
Name:Histone-arginine methyltransferase CARM1
Type:Protein
Mol. Mass.:65855.47
Organism:Homo sapiens (Human)
Description:Q86X55
Residue:608
BDBM50301080
NameBDBM50301080
Synonyms:CHEMBL567298 | N-methyl-2-(4-(7-methyl-2-phenyl-1H-benzo[d]imidazol-5-yl)piperidin-1-yl)ethanamine
TypeSmall organic molecule
Emp. Form.C22H28N4
Mol. Mass.348.4845
SMILESCNCCN1CCC(CC1)c1cc(C)c2nc([nH]c2c1)-c1ccccc1