Reaction Details
TargetHistone-arginine methyltransferase CARM1
LigandBDBM50301072
Substrate/Competitorn/a
Meas. Tech.ChEMBL_598368 (CHEMBL1037272)
IC50>30±n/a nM
Citation Wan, HHuynh, TPang, SGeng, JVaccaro, WPoss, MATrainor, GLLorenzi, MVGottardis, MJayaraman, LPurandare, AV Benzo[d]imidazole inhibitors of Coactivator Associated Arginine Methyltransferase 1 (CARM1)--Hit to Lead studies. Bioorg Med Chem Lett19:5063-6 (2009) 
 
Histone-arginine methyltransferase CARM1
Name:Histone-arginine methyltransferase CARM1
Type:Protein
Mol. Mass.:65855.47
Organism:Homo sapiens (Human)
Description:Q86X55
Residue:608
BDBM50301072
NameBDBM50301072
Synonyms:(R)-1-(4-(2-(2-methoxypyridin-3-yl)-4-methyl-1H-benzo[d]imidazol-6-yl)piperidin-1-yl)-N-methylpropan-2-amine | CHEMBL571217
TypeSmall organic molecule
Emp. Form.C23H31N5O
Mol. Mass.393.5251
SMILESCN[C@H](C)CN1CCC(CC1)c1cc(C)c2nc([nH]c2c1)-c1cccnc1OC