Reaction Details
TargetHistone-arginine methyltransferase CARM1
LigandBDBM50301079
Substrate/Competitorn/a
Meas. Tech.ChEMBL_598368 (CHEMBL1037272)
IC50 0.120000±n/a nM
Citation Wan, HHuynh, TPang, SGeng, JVaccaro, WPoss, MATrainor, GLLorenzi, MVGottardis, MJayaraman, LPurandare, AV Benzo[d]imidazole inhibitors of Coactivator Associated Arginine Methyltransferase 1 (CARM1)--Hit to Lead studies. Bioorg Med Chem Lett19:5063-6 (2009) 
 
Histone-arginine methyltransferase CARM1
Name:Histone-arginine methyltransferase CARM1
Type:Protein
Mol. Mass.:65855.47
Organism:Homo sapiens (Human)
Description:Q86X55
Residue:608
BDBM50301079
NameBDBM50301079
Synonyms:2-(4-(2-(2-fluoro-6-methoxyphenyl)-7-methyl-1H-benzo[d]imidazol-5-yl)piperidin-1-yl)-N-methylethanamine | CHEMBL571829
TypeSmall organic molecule
Emp. Form.C23H29FN4O
Mol. Mass.396.501
SMILESCNCCN1CCC(CC1)c1cc(C)c2nc([nH]c2c1)-c1c(F)cccc1OC