Reaction Details
TargetProstaglandin E synthase
LigandBDBM50302418
Substrate/Competitorn/a
Meas. Tech.ChEMBL_597591 (CHEMBL1050554)
IC50 57±n/a nM
Citation Giroux, ABoulet, LBrideau, CChau, AClaveau, DCôté, BEthier, DFrenette, RGagnon, MGuay, JGuiral, SMancini, JMartins, EMassé, FMéthot, NRiendeau, DRubin, JXu, DYu, HDucharme, YFriesen, RW Discovery of disubstituted phenanthrene imidazoles as potent, selective and orally active mPGES-1 inhibitors. Bioorg Med Chem Lett19:5837-41 (2009) 
 
Prostaglandin E synthase
Name:Prostaglandin E synthase
Type:Protein
Mol. Mass.:17112.22
Organism:Homo sapiens (Human)
Description:n/a
Residue:152
BDBM50302418
NameBDBM50302418
Synonyms:2-(6-chloro-9-(pyridin-3-ylethynyl)-1H-phenanthro[9,10-d]imidazol-2-yl)isophthalonitrile | CHEMBL568565
TypeSmall organic molecule
Emp. Form.C30H14ClN5
Mol. Mass.479.919
SMILESClc1ccc2c3nc([nH]c3c3ccc(cc3c2c1)C#Cc1cccnc1)-c1c(cccc1C#N)C#N