Reaction Details
TargetProstaglandin E synthase
LigandBDBM50302403
Substrate/Competitorn/a
Meas. Tech.ChEMBL_597590 (CHEMBL1050553)
IC50 3±n/a nM
Citation Giroux, ABoulet, LBrideau, CChau, AClaveau, DCôté, BEthier, DFrenette, RGagnon, MGuay, JGuiral, SMancini, JMartins, EMassé, FMéthot, NRiendeau, DRubin, JXu, DYu, HDucharme, YFriesen, RW Discovery of disubstituted phenanthrene imidazoles as potent, selective and orally active mPGES-1 inhibitors. Bioorg Med Chem Lett19:5837-41 (2009) 
 
Prostaglandin E synthase
Name:Prostaglandin E synthase
Type:Protein
Mol. Mass.:17112.22
Organism:Homo sapiens (Human)
Description:n/a
Residue:152
BDBM50302403
NameBDBM50302403
Synonyms:6,9-dibromo-2-(2-chloro-6-fluorophenyl)-1H-phenanthro[9,10-d]imidazole | CHEMBL568125
TypeSmall organic molecule
Emp. Form.C21H10Br2ClFN2
Mol. Mass.504.577
SMILESFc1cccc(Cl)c1-c1nc2c([nH]1)c1ccc(Br)cc1c1cc(Br)ccc21