Reaction Details
TargetProstaglandin E synthase
LigandBDBM50302426
Substrate/Competitorn/a
Meas. Tech.ChEMBL_597590 (CHEMBL1050553)
IC50 2±n/a nM
Citation Giroux, ABoulet, LBrideau, CChau, AClaveau, DCôté, BEthier, DFrenette, RGagnon, MGuay, JGuiral, SMancini, JMartins, EMassé, FMéthot, NRiendeau, DRubin, JXu, DYu, HDucharme, YFriesen, RW Discovery of disubstituted phenanthrene imidazoles as potent, selective and orally active mPGES-1 inhibitors. Bioorg Med Chem Lett19:5837-41 (2009) 
 
Prostaglandin E synthase
Name:Prostaglandin E synthase
Type:Protein
Mol. Mass.:17112.22
Organism:Homo sapiens (Human)
Description:n/a
Residue:152
BDBM50302426
NameBDBM50302426
Synonyms:2-(6-chloro-9-(2-hydroxy-2-methylpropyl)-1H-phenanthro[9,10-d]imidazol-2-yl)isophthalonitrile | CHEMBL584927
TypeSmall organic molecule
Emp. Form.C27H19ClN4O
Mol. Mass.450.919
SMILESCC(C)(O)Cc1ccc2c3[nH]c(nc3c3ccc(Cl)cc3c2c1)-c1c(cccc1C#N)C#N