Reaction Details
TargetHistone deacetylase 4
LigandBDBM50304782
Substrate/Competitorn/a
Meas. Tech.ChEMBL_605914 (CHEMBL1068531)
IC50 4.6±n/a nM
Citation Angibaud, PVan Emelen, KDecrane, Lvan Brandt, STen Holte, PPilatte, IRoux, BPoncelet, VSpeybrouck, DQueguiner, LGaurrand, SMariën, AFloren, WJanssen, LVerdonck, Mvan Dun, Jvan Gompel, JGilissen, RMackie, CDu Jardin, MPeeters, JNoppe, MVan Hijfte, LFreyne, EPage, MJanicot, MArts, J Identification of a series of substituted 2-piperazinyl-5-pyrimidylhydroxamic acids as potent histone deacetylase inhibitors. Bioorg Med Chem Lett20:294-8 (2010) 
 
Histone deacetylase 4
Name:Histone deacetylase 4
Type:Enzyme
Mol. Mass.:119049.39
Organism:Homo sapiens (Human)
Description:P56524
Residue:1084
BDBM50304782
NameBDBM50304782
Synonyms:CHEMBL609583 | N-hydroxy-2-(4-(naphthalen-2-ylsulfonyl)piperazin-1-yl)pyrimidine-5-carboxamide
TypeSmall organic molecule
Emp. Form.C19H19N5O4S
Mol. Mass.413.45
SMILESONC(=O)c1cnc(nc1)N1CCN(CC1)S(=O)(=O)c1ccc2ccccc2c1