Reaction Details
TargetTyrosine-protein kinase Lck
LigandBDBM50305135
Substrate/Competitorn/a
Meas. Tech.ChEMBL_603253 (CHEMBL1049477)
IC50 1±n/a nM
Citation Takayama, TUmemiya, HAmada, HYabuuchi, TKoami, TShiozawa, FOka, YTakaoka, AYamaguchi, AEndo, MSato, M Ring-fused pyrazole derivatives as potent inhibitors of lymphocyte-specific kinase (Lck): Structure, synthesis, and SAR. Bioorg Med Chem Lett20:112-6 (2010) 
 
Tyrosine-protein kinase Lck
Name:Tyrosine-protein kinase Lck
Type:n/a
Mol. Mass.:57987.83
Organism:Homo sapiens (Human)
Description:P06239
Residue:509
BDBM50305135
NameBDBM50305135
Synonyms:2-(3-carbamoyl-2-(4-phenoxyphenyl)-9,10-dihydro-4H-benzo[d]pyrazolo[1,5-a][1,3]diazepin-6-yloxy)acetic acid | CHEMBL605724
TypeSmall organic molecule
Emp. Form.C26H22N4O5
Mol. Mass.470.4767
SMILESNC(=O)c1c2Nc3cc(OCC(O)=O)ccc3CCn2nc1-c1ccc(Oc2ccccc2)cc1