Reaction Details
TargetFructose-1,6-bisphosphatase 1
LigandBDBM50305569
Substrate/Competitorn/a
Meas. Tech.ChEMBL_604514 (CHEMBL1074684)
IC50 70±n/a nM
Citation Kitas, EMohr, PKuhn, BHebeisen, PWessel, HPHaap, WRuf, ABenz, JJoseph, CHuber, WSanchez, RAPaehler, ABenardeau, AGubler, MSchott, BTozzo, E Sulfonylureido thiazoles as fructose-1,6-bisphosphatase inhibitors for the treatment of type-2 diabetes. Bioorg Med Chem Lett20:594-9 (2010) 
 
Fructose-1,6-bisphosphatase 1
Name:Fructose-1,6-bisphosphatase 1
Type:Protein
Mol. Mass.:36843.58
Organism:Homo sapiens (Human)
Description:Liver FBPase (P09467)
Residue:338
BDBM50305569
NameBDBM50305569
Synonyms:CHEMBL590597 | N-(5-bromothiazol-2-ylcarbamoyl)-5-(4-methoxy-2-methylphenyl)-4-methylthiophene-2-sulfonamide
TypeSmall organic molecule
Emp. Form.C17H16BrN3O4S3
Mol. Mass.502.426
SMILESCOc1ccc(-c2sc(cc2C)S(=O)(=O)NC(=O)Nc2ncc(Br)s2)c(C)c1