Reaction Details
TargetFructose-1,6-bisphosphatase 1
LigandBDBM50305571
Substrate/Competitorn/a
Meas. Tech.ChEMBL_604515 (CHEMBL1074685)
IC50 50±n/a nM
Citation Kitas, EMohr, PKuhn, BHebeisen, PWessel, HPHaap, WRuf, ABenz, JJoseph, CHuber, WSanchez, RAPaehler, ABenardeau, AGubler, MSchott, BTozzo, E Sulfonylureido thiazoles as fructose-1,6-bisphosphatase inhibitors for the treatment of type-2 diabetes. Bioorg Med Chem Lett20:594-9 (2010) 
 
Fructose-1,6-bisphosphatase 1
Name:Fructose-1,6-bisphosphatase 1
Type:Protein
Mol. Mass.:36843.58
Organism:Homo sapiens (Human)
Description:Liver FBPase (P09467)
Residue:338
BDBM50305571
NameBDBM50305571
Synonyms:CHEMBL601691 | N-(5-bromothiazol-2-ylcarbamoyl)-5-(6-methoxy-4-methylpyridin-3-yl)-4-methylthiophene-2-sulfonamide
TypeSmall organic molecule
Emp. Form.C16H15BrN4O4S3
Mol. Mass.503.414
SMILESCOc1cc(C)c(cn1)-c1sc(cc1C)S(=O)(=O)NC(=O)Nc1ncc(Br)s1