Reaction Details
TargetFructose-1,6-bisphosphatase 1
LigandBDBM50305557
Substrate/Competitorn/a
Meas. Tech.ChEMBL_604515 (CHEMBL1074685)
IC50 90±n/a nM
Citation Kitas, EMohr, PKuhn, BHebeisen, PWessel, HPHaap, WRuf, ABenz, JJoseph, CHuber, WSanchez, RAPaehler, ABenardeau, AGubler, MSchott, BTozzo, E Sulfonylureido thiazoles as fructose-1,6-bisphosphatase inhibitors for the treatment of type-2 diabetes. Bioorg Med Chem Lett20:594-9 (2010) 
 
Fructose-1,6-bisphosphatase 1
Name:Fructose-1,6-bisphosphatase 1
Type:Protein
Mol. Mass.:36843.58
Organism:Homo sapiens (Human)
Description:Liver FBPase (P09467)
Residue:338
BDBM50305557
NameBDBM50305557
Synonyms:CHEMBL611631 | N-(5-bromothiazol-2-ylcarbamoyl)-4-(6-fluoropyridin-3-yl)-3-methylbenzenesulfonamide
TypeSmall organic molecule
Emp. Form.C16H12BrFN4O3S2
Mol. Mass.471.324
SMILESCc1cc(ccc1-c1ccc(F)nc1)S(=O)(=O)NC(=O)Nc1ncc(Br)s1