Reaction Details
TargetNeuronal acetylcholine receptor subunit alpha-7
LigandBDBM50309873
Substrate/Competitorn/a
Meas. Tech.ChEMBL_611542 (CHEMBL1066386)
Ki 1±n/a nM
Citation O'Donnell, CJRogers, BNBronk, BSBryce, DKCoe, JWCook, KKDuplantier, AJEvrard, EHajós, MHoffmann, WEHurst, RSMaklad, NMather, RJMcLean, SNedza, FMO'Neill, BTPeng, LQian, WRottas, MMSands, SBSchmidt, AWShrikhande, AVSpracklin, DKWong, DFZhang, AZhang, L Discovery of 4-(5-methyloxazolo[4,5-b]pyridin-2-yl)-1,4-diazabicyclo[3.2.2]nonane (CP-810,123), a novel alpha 7 nicotinic acetylcholine receptor agonist for the treatment of cognitive disorders in schizophrenia: synthesis, SAR development, and in vivo efficacy in cognition models. J Med Chem53:1222-37 (2010) 
 
Neuronal acetylcholine receptor subunit alpha-7
Name:Neuronal acetylcholine receptor subunit alpha-7
Type:Enzyme
Mol. Mass.:56502.44
Organism:Rattus norvegicus (Rat)
Description:Q05941
Residue:502
BDBM50309873
NameBDBM50309873
Synonyms:4-(6-Chlorooxazolo[4,5-b]pyridin-2-yl)-1,4-diazabicyclo[3.2.2]-nonane | CHEMBL597241
TypeSmall organic molecule
Emp. Form.C13H15ClN4O
Mol. Mass.278.737
SMILESClc1cnc2nc(oc2c1)N1CCN2CCC1CC2