Reaction Details
TargetNeuronal acetylcholine receptor subunit alpha-7
LigandBDBM50309896
Substrate/Competitorn/a
Meas. Tech.ChEMBL_611542 (CHEMBL1066386)
Ki 67.1±n/a nM
Citation O'Donnell, CJRogers, BNBronk, BSBryce, DKCoe, JWCook, KKDuplantier, AJEvrard, EHajós, MHoffmann, WEHurst, RSMaklad, NMather, RJMcLean, SNedza, FMO'Neill, BTPeng, LQian, WRottas, MMSands, SBSchmidt, AWShrikhande, AVSpracklin, DKWong, DFZhang, AZhang, L Discovery of 4-(5-methyloxazolo[4,5-b]pyridin-2-yl)-1,4-diazabicyclo[3.2.2]nonane (CP-810,123), a novel alpha 7 nicotinic acetylcholine receptor agonist for the treatment of cognitive disorders in schizophrenia: synthesis, SAR development, and in vivo efficacy in cognition models. J Med Chem53:1222-37 (2010) 
 
Neuronal acetylcholine receptor subunit alpha-7
Name:Neuronal acetylcholine receptor subunit alpha-7
Type:Enzyme
Mol. Mass.:56502.44
Organism:Rattus norvegicus (Rat)
Description:Q05941
Residue:502
BDBM50309896
NameBDBM50309896
Synonyms:2-(5-(Piperidin-1-yl)oxazolo[4,5-b]pyridin-2-yl)-2,5-diazabicyclo-[3.2.2]nonane | CHEMBL599590
TypeSmall organic molecule
Emp. Form.C18H25N5O
Mol. Mass.327.424
SMILESC1CCN(CC1)c1ccc2oc(nc2n1)N1CCN2CCC1CC2