Reaction Details
TargetA disintegrin and metalloproteinase with thrombospondin motifs 5
LigandBDBM50311089
Substrate/Competitorn/a
Meas. Tech.ChEMBL_619828 (CHEMBL1106705)
IC50 770±n/a nM
Citation Shiozaki, MImai, HMaeda, KMiura, TYasue, KSuma, AYokota, MOgoshi, YHaas, JFryer, AMLaird, ERLittmann, NMAndrews, SWJosey, JAMimura, TShinozaki, YYoshiuchi, HInaba, T Synthesis and SAR of 2-phenyl-1-sulfonylaminocyclopropane carboxylates as ADAMTS-5 (Aggrecanase-2) inhibitors. Bioorg Med Chem Lett19:6213-7 (2009) 
 
A disintegrin and metalloproteinase with thrombospondin motifs 5
Name:A disintegrin and metalloproteinase with thrombospondin motifs 5
Type:Enzyme
Mol. Mass.:101769.09
Organism:Homo sapiens (Human)
Description:Q9UNA0
Residue:930
BDBM50311089
NameBDBM50311089
Synonyms:CHEMBL1078624 | rac-1-(5-(4-chloro-1H-pyrazol-1-yl)thiophene-2-sulfonamido)-2-isopropylcyclopropanecarboxylic acid
TypeSmall organic molecule
Emp. Form.C14H16ClN3O4S2
Mol. Mass.389.878
SMILESCC(C)[C@H]1C[C@@]1(NS(=O)(=O)c1ccc(s1)-n1cc(Cl)cn1)C(O)=O