Reaction Details
TargetA disintegrin and metalloproteinase with thrombospondin motifs 5
LigandBDBM50311091
Substrate/Competitorn/a
Meas. Tech.ChEMBL_619828 (CHEMBL1106705)
IC50 800±n/a nM
Citation Shiozaki, MImai, HMaeda, KMiura, TYasue, KSuma, AYokota, MOgoshi, YHaas, JFryer, AMLaird, ERLittmann, NMAndrews, SWJosey, JAMimura, TShinozaki, YYoshiuchi, HInaba, T Synthesis and SAR of 2-phenyl-1-sulfonylaminocyclopropane carboxylates as ADAMTS-5 (Aggrecanase-2) inhibitors. Bioorg Med Chem Lett19:6213-7 (2009) 
 
A disintegrin and metalloproteinase with thrombospondin motifs 5
Name:A disintegrin and metalloproteinase with thrombospondin motifs 5
Type:Enzyme
Mol. Mass.:101769.09
Organism:Homo sapiens (Human)
Description:Q9UNA0
Residue:930
BDBM50311091
NameBDBM50311091
Synonyms:CHEMBL1078322 | rac-1-(5-(4-chloro-1H-pyrazol-1-yl)thiophene-2-sulfonamido)-2,3-dimethylcyclopropanecarboxylic acid
TypeSmall organic molecule
Emp. Form.C13H14ClN3O4S2
Mol. Mass.375.851
SMILESC[C@H]1[C@@H](C)[C@@]1(NS(=O)(=O)c1ccc(s1)-n1cc(Cl)cn1)C(O)=O