Reaction Details
TargetHistamine H1 receptor
LigandBDBM50315200
Substrate/Competitorn/a
Meas. Tech.ChEMBL_625162 (CHEMBL1115183)
Ki 1.7±n/a nM
Citation Li, BFMoree, WJYu, JCoon, TZamani-Kord, SMalany, SJalali, KWen, JWang, HYang, CHoare, SRPetroski, REMadan, ACrowe, PDBeaton, G Selectivity profiling of novel indene H(1)-antihistamines for the treatment of insomnia. Bioorg Med Chem Lett20:2629-33 (2010) 
 
Histamine H1 receptor
Name:Histamine H1 receptor
Type:G Protein-Coupled Receptor (GPCR)
Mol. Mass.:55808.72
Organism:Homo sapiens (Human)
Description:Cell pellets from SK-N-MC cells transfected with human H1 receptor were used in binding assay.
Residue:487
BDBM50315200
NameBDBM50315200
Synonyms:2-(6-fluoro-3-(pyridazin-3-ylmethyl)-1H-inden-2-yl)-N,N-dimethylethanamine | CHEMBL1092662
TypeSmall organic molecule
Emp. Form.C18H20FN3
Mol. Mass.297.3699
SMILESCN(C)CCC1=C(Cc2cccnn2)c2ccc(F)cc2C1