Reaction Details
TargetSphingosine 1-phosphate receptor 1
LigandBDBM50249240
Substrate/Competitorn/a
Meas. Tech.ChEMBL_627320 (CHEMBL1108112)
IC50 1.05±n/a nM
Citation Evindar, GBernier, SGDoyle, EKavarana, MJSatz, ALLorusso, JBlanchette, HSSaha, AKHannig, GMorgan, BAWestlin, WF Exploration of amino alcohol derivatives as novel, potent, and highly selective sphingosine-1-phosphate receptor subtype-1 agonists. Bioorg Med Chem Lett20:2520-4 (2010) 
 
Sphingosine 1-phosphate receptor 1
Name:Sphingosine 1-phosphate receptor 1
Type:Enzyme
Mol. Mass.:42836.02
Organism:Homo sapiens (Human)
Description:P21453
Residue:382
BDBM50249240
NameBDBM50249240
Synonyms:(S)-2-amino-3-(4-(2-(biphenyl-4-yl)ethoxy)phenylamino)-2-methyl-3-oxopropyl dihydrogen phosphate | CHEMBL475405
TypeSmall organic molecule
Emp. Form.C24H27N2O6P
Mol. Mass.470.4547
SMILESC[C@](N)(COP(O)(O)=O)C(=O)Nc1ccc(OCCc2ccc(cc2)-c2ccccc2)cc1