Reaction Details
TargetSphingosine 1-phosphate receptor 3
LigandBDBM50315556
Substrate/Competitorn/a
Meas. Tech.ChEMBL_627321 (CHEMBL1108113)
IC50 285±n/a nM
Citation Evindar, GBernier, SGDoyle, EKavarana, MJSatz, ALLorusso, JBlanchette, HSSaha, AKHannig, GMorgan, BAWestlin, WF Exploration of amino alcohol derivatives as novel, potent, and highly selective sphingosine-1-phosphate receptor subtype-1 agonists. Bioorg Med Chem Lett20:2520-4 (2010) 
 
Sphingosine 1-phosphate receptor 3
Name:Sphingosine 1-phosphate receptor 3
Type:G Protein-Coupled Receptor (GPCR)
Mol. Mass.:42278.13
Organism:Homo sapiens (Human)
Description:Q99500
Residue:378
BDBM50315556
NameBDBM50315556
Synonyms:(S)-2-amino-3-(4-(2-(biphenyl-4-yl)ethoxy)-3-chlorophenylamino)-2-methyl-3-oxopropyl dihydrogen phosphate | CHEMBL1088820
TypeSmall organic molecule
Emp. Form.C24H26ClN2O6P
Mol. Mass.504.9
SMILESC[C@](N)(COP(O)(O)=O)C(=O)Nc1ccc(OCCc2ccc(cc2)-c2ccccc2)c(Cl)c1