Reaction Details
TargetSphingosine 1-phosphate receptor 3
LigandBDBM50315558
Substrate/Competitorn/a
Meas. Tech.ChEMBL_627321 (CHEMBL1108113)
IC50 3250±n/a nM
Citation Evindar, GBernier, SGDoyle, EKavarana, MJSatz, ALLorusso, JBlanchette, HSSaha, AKHannig, GMorgan, BAWestlin, WF Exploration of amino alcohol derivatives as novel, potent, and highly selective sphingosine-1-phosphate receptor subtype-1 agonists. Bioorg Med Chem Lett20:2520-4 (2010) 
 
Sphingosine 1-phosphate receptor 3
Name:Sphingosine 1-phosphate receptor 3
Type:G Protein-Coupled Receptor (GPCR)
Mol. Mass.:42278.13
Organism:Homo sapiens (Human)
Description:Q99500
Residue:378
BDBM50315558
NameBDBM50315558
Synonyms:(S)-2-amino-3-(4-(2-(biphenyl-4-yl)ethoxy)-3-methylphenylamino)-2-methyl-3-oxopropyl dihydrogen phosphate | CHEMBL1093424
TypeSmall organic molecule
Emp. Form.C25H29N2O6P
Mol. Mass.484.4813
SMILESCc1cc(NC(=O)[C@@](C)(N)COP(O)(O)=O)ccc1OCCc1ccc(cc1)-c1ccccc1