Reaction Details
TargetSphingosine 1-phosphate receptor 4
LigandBDBM50249240
Substrate/Competitorn/a
Meas. Tech.ChEMBL_627322 (CHEMBL1108114)
IC50 10.3±n/a nM
Citation Evindar, GBernier, SGDoyle, EKavarana, MJSatz, ALLorusso, JBlanchette, HSSaha, AKHannig, GMorgan, BAWestlin, WF Exploration of amino alcohol derivatives as novel, potent, and highly selective sphingosine-1-phosphate receptor subtype-1 agonists. Bioorg Med Chem Lett20:2520-4 (2010) 
 
Sphingosine 1-phosphate receptor 4
Name:Sphingosine 1-phosphate receptor 4
Type:G Protein-Coupled Receptor (GPCR)
Mol. Mass.:41647.39
Organism:Homo sapiens (Human)
Description:n/a
Residue:384
BDBM50249240
NameBDBM50249240
Synonyms:(S)-2-amino-3-(4-(2-(biphenyl-4-yl)ethoxy)phenylamino)-2-methyl-3-oxopropyl dihydrogen phosphate | CHEMBL475405
TypeSmall organic molecule
Emp. Form.C24H27N2O6P
Mol. Mass.470.4547
SMILESC[C@](N)(COP(O)(O)=O)C(=O)Nc1ccc(OCCc2ccc(cc2)-c2ccccc2)cc1