Reaction Details
TargetSphingosine 1-phosphate receptor 1
LigandBDBM50249266
Substrate/Competitorn/a
Meas. Tech.ChEMBL_627320 (CHEMBL1108112)
IC50 1.03±n/a nM
Citation Evindar, GBernier, SGDoyle, EKavarana, MJSatz, ALLorusso, JBlanchette, HSSaha, AKHannig, GMorgan, BAWestlin, WF Exploration of amino alcohol derivatives as novel, potent, and highly selective sphingosine-1-phosphate receptor subtype-1 agonists. Bioorg Med Chem Lett20:2520-4 (2010) 
 
Sphingosine 1-phosphate receptor 1
Name:Sphingosine 1-phosphate receptor 1
Type:Enzyme
Mol. Mass.:42836.02
Organism:Homo sapiens (Human)
Description:P21453
Residue:382
BDBM50249266
NameBDBM50249266
Synonyms:(R)-2-amino-2-(4-(4-(biphenyl-4-ylmethoxy)phenyl)-1H-imidazol-2-yl)propyl dihydrogen phosphate | CHEMBL514170
TypeSmall organic molecule
Emp. Form.C25H26N3O5P
Mol. Mass.479.4648
SMILESC[C@](N)(COP(O)(O)=O)c1nc(c[nH]1)-c1ccc(OCc2ccc(cc2)-c2ccccc2)cc1