Reaction Details
TargetBeta-secretase 1
LigandBDBM50318126
Substrate/Competitorn/a
Meas. Tech.ChEMBL_632138 (CHEMBL1103872)
Ki 186±n/a nM
Citation Huang, YStrobel, EDHo, CYReynolds, CHConway, KAPiesvaux, JABrenneman, DEYohrling, GJMoore Arnold, HRosenthal, DAlexander, RSTounge, BAMercken, MVandermeeren, MParker, MHReitz, ABBaxter, EW Macrocyclic BACE inhibitors: Optimization of a micromolar hit to nanomolar leads. Bioorg Med Chem Lett20:3158-60 (2010) 
 
Beta-secretase 1
Name:Beta-secretase 1
Type:Protein
Mol. Mass.:55755.10
Organism:Homo sapiens (Human)
Description:P56817
Residue:501
BDBM50318126
NameBDBM50318126
Synonyms:(15R)-17-amino-11,15-dicyclohexyl-2-oxa-11,16,18-triazatetracyclo[14.5.3.1^{3,7}.0^{19,23}]pentacosa-1(22),3(25),4,6,17,19(23),20-heptaen-12-one | CHEMBL1098735
TypeSmall organic molecule
Emp. Form.C33H44N4O2
Mol. Mass.528.7281
SMILESNC1=Nc2ccc3Oc4cccc(CCCN(C5CCCCC5)C(=O)CC[C@H](C5CCCCC5)N1Cc2c3)c4