Reaction Details
Target5-hydroxytryptamine receptor 3A
LigandBDBM50319676
Substrate/Competitorn/a
Meas. Tech.ChEMBL_634700 (CHEMBL1118785)
IC50 5700±n/a nM
Citation Ghiron, CHaydar, SNAschmies, SBothmann, HCastaldo, CCocconcelli, GComery, TADi, LDunlop, JLock, TKramer, AKowal, DJow, FGrauer, SHarrison, BLa Rosa, SMaccari, LMarquis, KLMicco, INencini, AQuinn, JRobichaud, AJRoncarati, RScali, CTerstappen, GCTurlizzi, EValacchi, MVarrone, MZanaletti, RZanelli, U Novel alpha-7 nicotinic acetylcholine receptor agonists containing a urea moiety: identification and characterization of the potent, selective, and orally efficacious agonist 1-[6-(4-fluorophenyl)pyridin-3-yl]-3-(4-piperidin-1-ylbutyl) urea (SEN34625/WYE-103914). J Med Chem53:4379-89 (2010) 
 
5-hydroxytryptamine receptor 3A
Name:5-hydroxytryptamine receptor 3A
Type:Protein
Mol. Mass.:55283.27
Organism:Homo sapiens (Human)
Description:P46098
Residue:478
BDBM50319676
NameBDBM50319676
Synonyms:1-(2'-fluorobiphenyl-4-yl)-3-(4-(piperidin-1-yl)butyl)urea | CHEMBL1085379
TypeSmall organic molecule
Emp. Form.C22H28FN3O
Mol. Mass.369.4756
SMILESFc1ccccc1-c1ccc(NC(=O)NCCCCN2CCCCC2)cc1