Reaction Details
TargetTyrosine-protein kinase ABL1
LigandBDBM50322549
Substrate/Competitorn/a
Meas. Tech.ChEMBL_641693 (CHEMBL1176860)
IC50 9.1±n/a nM
Citation Huang, WSMetcalf, CASundaramoorthi, RWang, YZou, DThomas, RMZhu, XCai, LWen, DLiu, SRomero, JQi, JChen, IBanda, GLentini, SPDas, SXu, QKeats, JWang, FWardwell, SNing, YSnodgrass, JTBroudy, MIRussian, KZhou, TCommodore, LNarasimhan, NIMohemmad, QKIuliucci, JRivera, VMDalgarno, DCSawyer, TKClackson, TShakespeare, WC Discovery of 3-[2-(imidazo[1,2-b]pyridazin-3-yl)ethynyl]-4-methyl-N-{4-[(4-methylpiperazin-1-yl)methyl]-3-(trifluoromethyl)phenyl}benzamide (AP24534), a potent, orally active pan-inhibitor of breakpoint cluster region-abelson (BCR-ABL) kinase including the T315I gatekeeper mutant. J Med Chem53:4701-19 (2010) 
 
Tyrosine-protein kinase ABL1
Name:Tyrosine-protein kinase ABL1
Type:Enzyme
Mol. Mass.:122897.30
Organism:Homo sapiens (Human)
Description:P00519
Residue:1130
BDBM50322549
NameBDBM50322549
Synonyms:3-[2-(Imidazo[1,2-a]pyridin-3-yl)ethynyl]-4-methyl-N-{4-[(1-methyl-4-piperidinyl)oxy]-3-(trifluoromethyl)phenyl}benzamide | CHEMBL1169881
TypeSmall organic molecule
Emp. Form.C30H27F3N4O2
Mol. Mass.532.5562
SMILESCN1CCC(CC1)Oc1ccc(NC(=O)c2ccc(C)c(c2)C#Cc2cnc3ccccn23)cc1C(F)(F)F