Reaction Details
TargetCytochrome P450 11B2, mitochondrial
LigandBDBM50323358
Substrate/Competitorn/a
Meas. Tech.ChEMBL_643964 (CHEMBL1211863)
IC50 2.4±n/a nM
Citation Adams, CMHu, CWJeng, AYKarki, RKsander, GLasala, DLeung-Chu, JLiang, GLiu, QMeredith, ERao, CRigel, DFShi, JSmith, SSpringer, CZhang, C The discovery of potent inhibitors of aldosterone synthase that exhibit selectivity over 11-beta-hydroxylase. Bioorg Med Chem Lett20:4324-7 (2010) 
 
Cytochrome P450 11B2, mitochondrial
Name:Cytochrome P450 11B2, mitochondrial
Type:Protein
Mol. Mass.:57582.15
Organism:Homo sapiens (Human)
Description:P19099
Residue:503
BDBM50323358
NameBDBM50323358
Synonyms:(R)-2-{6-[(S)-1-(4-Chloro-phenyl)-ethyl]-5,5-dioxo-4,5,6,7-tetrahydro-5lambda*6*-thia-2,3a,6-triaza-inden-4-yl}-1-phenyl-ethanol | CHEMBL1209695
TypeSmall organic molecule
Emp. Form.C21H22ClN3O3S
Mol. Mass.431.936
SMILESC[C@H](N1Cc2cncn2C(C[C@@H](O)c2ccccc2)S1(=O)=O)c1ccc(Cl)cc1